BDBM50396170 CHEMBL2031566
SMILES OC(=O)CSc1cc(NS(=O)(=O)c2ccc(cc2)C(O)=O)c2ccccc2c1O
InChI Key InChIKey=CIERPRDYPKVDJO-UHFFFAOYSA-N
Data  5 IC50
  Tab Delimited (TSV)   2D SDfile   Computed 3D by Vconf -m prep SDfile
Find this compound or compounds like it in BindingDB:
Activity Spreadsheet -- Enzyme Inhibition Constant Data from BindingDB
Found 5 hits for monomerid = 50396170
TargetHistone acetyltransferase GCN5(Saccharomyces cerevisiae S288c)
Mayo Clinic
Curated by ChEMBL
LigandPNGBDBM50396170(CHEMBL2031566)
Affinity DataIC50:  150nM. Assay description: Inhibition of Vps75-stimulated recombinant Saccharomyces cerevisiae histone acetyltransferase Rtt109 using [3H]-acetyl-CoA assessed as acetate incorp...
In DepthDetails ArticlePubMed
TargetHistone acetyltransferase p300(Homo sapiens (Human))
Mayo Clinic
Curated by ChEMBL
LigandPNGBDBM50396170(CHEMBL2031566)
Affinity DataIC50:  660nM. Assay description: Inhibition of recombinant histone acetyltransferase p300 (unknown origin) using dH3-H4 tetramer and [3H]-acetyl-CoA assessed as acetate incorporation...
In DepthDetails ArticlePubMed
TargetSignal transducer and activator of transcription 3(Homo sapiens (Human))
University Of Southern California
Curated by ChEMBL
LigandPNGBDBM50396170(CHEMBL2031566)
Affinity DataIC50:  2.00E+4nM. Assay description: Inhibition of recombinant STAT3 assessed as inhibition of STAT3-phosphododecapeptide interaction by SPR analysis
In DepthDetails ArticlePubMed
TargetSignal transducer and activator of transcription 3(Homo sapiens (Human))
University Of Southern California
Curated by ChEMBL
LigandPNGBDBM50396170(CHEMBL2031566)
Affinity DataIC50:  7.30E+4nM. Assay description: Inhibition of IL6-mediated STAT3 phosphorylation in human HepG2 cells preincubated for 1 hr prior to IL6 challenge measured after 30 mins by immunobl...
In DepthDetails ArticlePubMed
TargetHistone acetyltransferase GCN5(Saccharomyces cerevisiae S288c)
Mayo Clinic
Curated by ChEMBL
LigandPNGBDBM50396170(CHEMBL2031566)
Affinity DataIC50:  1.30E+3nM. Assay description: Inhibition of yeast histone acetyltransferase Gcn5-Ada2-Ada3 complex using tetramer and [3H]-acetyl-CoA assessed as acetate incorporation after 30 mi...
In DepthDetails ArticlePubMed