BDBM50396203 CHEMBL2172038
SMILES Cc1[nH]nc(C(O)=O)c1Cc1cccc(c1)-c1ccc(cc1)C#N
InChI Key InChIKey=NDLJYTPNOKOONM-UHFFFAOYSA-N
Data  1 IC50
  Tab Delimited (TSV)   2D SDfile   Computed 3D by Vconf -m prep SDfile
Find this compound or compounds like it in BindingDB:
Activity Spreadsheet -- Enzyme Inhibition Constant Data from BindingDB
Found 1 hit for monomerid = 50396203
Target2-Hydroxyacid oxidase 2(Rattus norvegicus)
Advinus Therapeutics
Curated by ChEMBL
LigandPNGBDBM50396203(CHEMBL2172038)
Affinity DataIC50:  300nM. Assay description: Inhibition of rat Hao2-mediated oxidation of 2-hydroxyoctanoic acid assessed as proportionate release of H2O2
In DepthDetails ArticlePubMed