BDBM50396465 CHEMBL2169894
SMILES CCC(=O)N1CCC(CC1)c1cc(C)c(cc1S(C)(=O)=O)C(=O)NC(N)=N
InChI Key InChIKey=FUXADAMOXLPXMT-UHFFFAOYSA-N
Data  2 IC50
  Tab Delimited (TSV)   2D SDfile   Computed 3D by Vconf -m prep SDfile
Find this compound or compounds like it in BindingDB:
Activity Spreadsheet -- Enzyme Inhibition Constant Data from BindingDB
Found 2 hits for monomerid = 50396465
TargetSodium/hydrogen exchanger 1(Homo sapiens (Human))
Boehringer Ingelheim Pharmaceuticals
Curated by ChEMBL
LigandPNGBDBM50396465(CHEMBL2169894)
Affinity DataIC50:  15nM. Assay description: Inhibition of NHE1 in human HT-29 cells assessed as intracellular pH change after 30 mins
In DepthDetails ArticlePubMed
TargetSodium/hydrogen exchanger 1(Homo sapiens (Human))
Boehringer Ingelheim Pharmaceuticals
Curated by ChEMBL
LigandPNGBDBM50396465(CHEMBL2169894)
Affinity DataIC50:  88nM. Assay description: Inhibition of NHE1 in human platelet rich plasma assessed as reduction of propionate medium induced platelet swelling measured every 6 secs for 5 min...
In DepthDetails ArticlePubMed