BDBM50396540 CHEMBL2171143
SMILES Cc1ccccc1CC(=O)N1CCc2cc(ccc12)-c1cn(C)c2ncnc(N)c12
InChI Key InChIKey=RHJIUZMDTSMYFE-UHFFFAOYSA-N
Data  1 IC50
  Tab Delimited (TSV)   2D SDfile   Computed 3D by Vconf -m prep SDfile
Find this compound or compounds like it in BindingDB:
Activity Spreadsheet -- Enzyme Inhibition Constant Data from BindingDB
Found 1 hit for monomerid = 50396540
TargetEukaryotic translation initiation factor 2-alpha kinase 3(Homo sapiens (Human))
Glaxosmithkline
Curated by ChEMBL
LigandPNGBDBM50396540(CHEMBL2171143)
Affinity DataIC50:  0.200nM. Assay description: Inhibition of GST tagged PERK cytoplasmic domain mediated EIF2alpha phosphorylation
In DepthDetails ArticlePubMed