BDBM50396706 CHEMBL2172070
SMILES O=C(N1CCSCC1)c1cccc(c1)S(=O)(=O)N1CCc2ccccc2C1
InChI Key InChIKey=AYBGIGGYSMCTKR-UHFFFAOYSA-N
Data  4 IC50
  Tab Delimited (TSV)   2D SDfile   Computed 3D by Vconf -m prep SDfile
Find this compound or compounds like it in BindingDB:
Activity Spreadsheet -- Enzyme Inhibition Constant Data from BindingDB
Found 4 hits for monomerid = 50396706
TargetAldo-keto reductase family 1 member C4(Homo sapiens (Human))
University Of Auckland
Curated by ChEMBL
LigandPNGBDBM50396706(CHEMBL2172070)
Affinity DataIC50: >3.00E+4nM. Assay description: Inhibition of human recombinant N-terminal His6-tagged AKR1C4 expressed in Escherichia coli BL21(DE3) cells using 8-Acetyl-2,3,5,6-tetrahydro-1H,4H-1...
In DepthDetails ArticlePubMed
TargetAldo-keto reductase family 1 member C1(Homo sapiens (Human))
University Of Auckland
Curated by ChEMBL
LigandPNGBDBM50396706(CHEMBL2172070)
Affinity DataIC50: >3.00E+4nM. Assay description: Inhibition of human recombinant N-terminal His6-tagged AKR1C1 expressed in Escherichia coli BL21(DE3) cells using 8-Acetyl-2,3,5,6-tetrahydro-1H,4H-1...
In DepthDetails ArticlePubMed
TargetAldo-keto reductase family 1 member C3(Homo sapiens (Human))
University Of Auckland
Curated by ChEMBL
LigandPNGBDBM50396706(CHEMBL2172070)
Affinity DataIC50:  450nM. Assay description: Inhibition of human recombinant N-terminal His6-tagged AKR1C3 expressed in Escherichia coli BL21(DE3) cells using 8-Acetyl-2,3,5,6-tetrahydro-1H,4H-1...
In DepthDetails ArticlePubMed
TargetAldo-keto reductase family 1 member C2(Homo sapiens (Human))
University Of Auckland
Curated by ChEMBL
LigandPNGBDBM50396706(CHEMBL2172070)
Affinity DataIC50: >3.00E+4nM. Assay description: Inhibition of human recombinant N-terminal His6-tagged AKR1C2 expressed in Escherichia coli BL21(DE3) cells using 8-Acetyl-2,3,5,6-tetrahydro-1H,4H-1...
In DepthDetails ArticlePubMed