BDBM50396883 CHEMBL2170667
SMILES C(N1CCC2(CC1)OCCc1cscc21)c1ccccc1
InChI Key InChIKey=PLSSOIAPXIDXEA-UHFFFAOYSA-N
Data  1 KI
  Tab Delimited (TSV)   2D SDfile   Computed 3D by Vconf -m prep SDfile
Find this compound or compounds like it in BindingDB:
Activity Spreadsheet -- Enzyme Inhibition Constant Data from BindingDB
Found 1 hit for monomerid = 50396883
TargetSigma non-opioid intracellular receptor 1(Cavia porcellus (Guinea pig))
Institut F£R Pharmazeutische Und Medizinische Chemie Der Westf£Lischen Wilhelms-Universit£T M£Nster
Curated by ChEMBL
LigandPNGBDBM50396883(CHEMBL2170667)
Affinity DataKi:  0.350nM. Assay description: Displacement of [3H]-(+)-pentazocine from sigma 1 receptor in guinea pig brain membranes after 120 mins by scintillation counting
In DepthDetails ArticlePubMed