BDBM50397029 CHEMBL2171175
SMILES N[C@@H](CCSC[C@H]1O[C@H]([C@H](O)[C@@H]1O)n1cnc2c(NCC=C)ncnc12)C(O)=O
InChI Key InChIKey=YLLRVQFVEDAERU-UOYPZJKHSA-N
Data  1 KI
  Tab Delimited (TSV)   2D SDfile   Computed 3D by Vconf -m prep SDfile
Find this compound or compounds like it in BindingDB:
Activity Spreadsheet -- Enzyme Inhibition Constant Data from BindingDB
Found 1 hit for monomerid = 50397029
TargetHistone-lysine N-methyltransferase, H3 lysine-79 specific(Homo sapiens (Human))
Baylor College Of Medicine
Curated by ChEMBL
LigandPNGBDBM50397029(CHEMBL2171175)
Affinity DataKi:  2.00E+3nM. Assay description: Inhibition of human recombinant DOT1L catalytic domain amino acid (1 to 472) using [3H]-SAM after 30 mins by scintillation counter
In DepthDetails ArticlePubMed