BDBM50397095 CHEMBL2171653
SMILES COc1ccc(cc1Br)C1=NN(C(C)C)C(=O)C1(C)C
InChI Key InChIKey=VYBVQFBCCQONCN-UHFFFAOYSA-N
Data  1 IC50
  Tab Delimited (TSV)   2D SDfile   Computed 3D by Vconf -m prep SDfile
Find this compound or compounds like it in BindingDB:
Activity Spreadsheet -- Enzyme Inhibition Constant Data from BindingDB
Found 1 hit for monomerid = 50397095
TargetPhosphodiesterase(Trypanosoma brucei)
Vu University Amsterdam
Curated by ChEMBL
LigandPNGBDBM50397095(CHEMBL2171653)
Affinity DataIC50: >1.00E+4nM. Assay description: Inhibition of Trypanosoma brucei recombinant TbrPDEB1 expressed in Sf21 insect cells assessed as reduction of [3H]-cAMP hydrolysis by scintillation p...
In DepthDetails ArticlePubMed