BDBM50397099 CHEMBL2171465
SMILES COc1ccc(cc1Cl)C1=NNC(=O)C1(C)C
InChI Key InChIKey=VQPZKBIAIXDDEP-UHFFFAOYSA-N
Data  1 IC50
  Tab Delimited (TSV)   2D SDfile   Computed 3D by Vconf -m prep SDfile
Find this compound or compounds like it in BindingDB:
Activity Spreadsheet -- Enzyme Inhibition Constant Data from BindingDB
Found 1 hit for monomerid = 50397099
TargetPhosphodiesterase(Trypanosoma brucei)
Vu University Amsterdam
Curated by ChEMBL
LigandPNGBDBM50397099(CHEMBL2171465)
Affinity DataIC50: >1.00E+4nM. Assay description: Inhibition of Trypanosoma brucei recombinant TbrPDEB1 expressed in Sf21 insect cells assessed as reduction of [3H]-cAMP hydrolysis by scintillation p...
In DepthDetails ArticlePubMed