BDBM50397265 CHEMBL2169939
SMILES Cc1cccc(c1)-c1ccc(cc1)[C@@H]1C[C@@H]1c1cc(=O)n(C)c(N)n1
InChI Key InChIKey=STUBOTPNCNDBOA-ROUUACIJSA-N
Data  1 IC50
PDB links: 1 PDB ID matches this monomer.
  Tab Delimited (TSV)   2D SDfile   Computed 3D by Vconf -m prep SDfile
Find this compound or compounds like it in BindingDB:
Activity Spreadsheet -- Enzyme Inhibition Constant Data from BindingDB
Found 1 hit for monomerid = 50397265
TargetBeta-secretase 1(Homo sapiens (Human))
Shionogi
Curated by ChEMBL
LigandPNGBDBM50397265(CHEMBL2169939)
Affinity DataIC50:  1.71E+4nM. Assay description: Inhibition of human recombinant BACE1 using biotin-XSEVNLDAEFRHDSGC-Eu as substrate after 3 hrs by HTRF assay