BDBM50397284 CHEMBL2169970
SMILES CN1CCN(CC1)c1cc(N)c2ccccc2n1
InChI Key InChIKey=GRQDDYOXJKSBNX-UHFFFAOYSA-N
Data  1 KI
  Tab Delimited (TSV)   2D SDfile   Computed 3D by Vconf -m prep SDfile
Find this compound or compounds like it in BindingDB:
Activity Spreadsheet -- Enzyme Inhibition Constant Data from BindingDB
Found 1 hit for monomerid = 50397284
Target5-hydroxytryptamine receptor 3A(Homo sapiens (Human))
Vu University Amsterdam
Curated by ChEMBL
LigandPNGBDBM50397284(CHEMBL2169970)
Affinity DataKi:  1.45nM. Assay description: Displacement of [3H]granisetron from 5HT3A receptor expressed in HEK293 cells after 24 hrs by scintillation counting in presence of quipazine
In DepthDetails ArticlePubMed