BDBM50397314 CHEMBL2170127
SMILES OC1=NC(=S)C(S1)=Cc1ccc(O)c(O)c1O
InChI Key InChIKey=AEYVPPVMCLJOGX-UHFFFAOYSA-N
Data  5 IC50
  Tab Delimited (TSV)   2D SDfile   Computed 3D by Vconf -m prep SDfile
Find this compound or compounds like it in BindingDB:
Activity Spreadsheet -- Enzyme Inhibition Constant Data from BindingDB
Found 5 hits for monomerid = 50397314
TargetTyrosyl-DNA phosphodiesterase 1(Homo sapiens (Human))
University Of Minnesota
Curated by ChEMBL
LigandPNGBDBM50397314(CHEMBL2170127)
Affinity DataIC50:  870nM. Assay description: Inhibition of human recombinant Tdp1 assessed as conversion of 14-mer 5'-32P-labeled 3'-phosphotyrosyl DNA substrate N14Y to 14-mer 5'-32P-labeled 3'...
In DepthDetails ArticlePubMed
TargetTyrosyl-DNA phosphodiesterase 1(Homo sapiens (Human))
University Of Minnesota
Curated by ChEMBL
LigandPNGBDBM50397314(CHEMBL2170127)
Affinity DataIC50:  3.50E+4nM. Assay description: Inhibition of human recombinant Tdp1 expressed in Tdp1 knockout chicken DT40 cells using 5'-32P-labeled 5'-GATCTAAAAGACTT-pY-3' as substrate after 15...
In DepthDetails ArticlePubMed
TargetTyrosyl-DNA phosphodiesterase 1(Homo sapiens (Human))
University Of Minnesota
Curated by ChEMBL
LigandPNGBDBM50397314(CHEMBL2170127)
Affinity DataIC50:  870nM. Assay description: Inhibition of recombinant human TDP1 measured by real-time oligonucleotide biosensor assay
In DepthDetails PubMed
TargetTyrosyl-DNA phosphodiesterase 1(Homo sapiens (Human))
University Of Minnesota
Curated by ChEMBL
LigandPNGBDBM50397314(CHEMBL2170127)
Affinity DataIC50:  2.80E+3nM. Assay description: Inhibition of human recombinant Tdp1 assessed as conversion of 14-mer 5'-32P-labeled 3'-phosphotyrosyl DNA substrate N14Y to 14-mer 5'-32P-labeled 3'...
In DepthDetails ArticlePubMed
TargetTyrosyl-DNA phosphodiesterase 2(Homo sapiens (Human))
University Of Minnesota
Curated by ChEMBL
LigandPNGBDBM50397314(CHEMBL2170127)
Affinity DataIC50:  1.70E+4nM. Assay description: Inhibition of recombinant Tdp2
In DepthDetails ArticlePubMed