BDBM50397416 CHEMBL2170555
SMILES COC(=O)[C@H]1[C@@H](O)[C@@]2(O)c3c(O[C@]2([C@@H]1c1ccccc1)c1ccc(OC)cc1)cc(cc3OC)C(C)=O
InChI Key InChIKey=JMTJQGAMQVTDMS-IDAMAFBJSA-N
Data  2 EC50
  Tab Delimited (TSV)   2D SDfile   Computed 3D by Vconf -m prep SDfile
Find this compound or compounds like it in BindingDB:
Activity Spreadsheet -- Enzyme Inhibition Constant Data from BindingDB
Found 2 hits for monomerid = 50397416
TargetEukaryotic initiation factor 4A-I(Homo sapiens (Human))
Infinity Pharmaceuticals
Curated by ChEMBL
LigandPNGBDBM50397416(CHEMBL2170555)
Affinity DataEC50:  30nM. Assay description: Inhibition of eIF4FA in human MDA-MB-231 cells transfected with tubulin 5'-UTR-luciferase construct assessed as reduction in translation initiation i...
In DepthDetails ArticlePubMed
TargetEukaryotic initiation factor 4A-I(Homo sapiens (Human))
Infinity Pharmaceuticals
Curated by ChEMBL
LigandPNGBDBM50397416(CHEMBL2170555)
Affinity DataEC50:  1nM. Assay description: Inhibition of eIF4FA in human MDA-MB-231 cells transfected with c-myc- 5'-UTR-luciferase construct assessed as reduction in translation initiation in...
In DepthDetails ArticlePubMed