BDBM50397472 CHEMBL2171010
SMILES CN1CCN(CCCNC(=O)c2c(C)n(C)c(c2-c2cccc(c2)N2CCN(CC2)c2ccc(NS(=O)(=O)c3cccc(OC(F)(F)F)c3)cc2)-c2ccc(Cl)cc2)CC1
InChI Key InChIKey=IWYTYDQYKZSAOE-UHFFFAOYSA-N
Data  1 KI  1 IC50
  Tab Delimited (TSV)   2D SDfile   Computed 3D by Vconf -m prep SDfile
Find this compound or compounds like it in BindingDB:
Activity Spreadsheet -- Enzyme Inhibition Constant Data from BindingDB
Found 2 hits for monomerid = 50397472
TargetApoptosis regulator Bcl-2(Homo sapiens (Human))
University Of Michigan
Curated by ChEMBL
LigandPNGBDBM50397472(CHEMBL2171010)
Affinity DataKi:  197nM. Assay description: Binding affinity to N-terminal 6xHis-tagged human Bcl-2 expressed in Escherichia coli BL21 (DE3) after 2 hrs by fluorescence polarization assay
In DepthDetails ArticlePubMed
TargetApoptosis regulator Bcl-2(Homo sapiens (Human))
University Of Michigan
Curated by ChEMBL
LigandPNGBDBM50397472(CHEMBL2171010)
Affinity DataIC50:  763nM. Assay description: Inhibition of N-terminal 6xHis-tagged human Bcl-2 expressed in Escherichia coli BL21 (DE3) after 2 hrs by fluorescence polarization assay
In DepthDetails ArticlePubMed