BDBM50397554 CHEMBL2171253
SMILES C[C@H](C(O)=O)c1ccc2c(c1)n(C(=O)c1cocn1)c1ccc(Cl)cc21
InChI Key InChIKey=OXMGMNBSFVVJAF-JTQLQIEISA-N
Data  3 IC50
  Tab Delimited (TSV)   2D SDfile   Computed 3D by Vconf -m prep SDfile
Find this compound or compounds like it in BindingDB:
Activity Spreadsheet -- Enzyme Inhibition Constant Data from BindingDB
Found 3 hits for monomerid = 50397554
TargetProstaglandin G/H synthase 2(Homo sapiens (Human))
Istituto Italiano Di Tecnologia
Curated by ChEMBL
LigandPNGBDBM50397554(CHEMBL2171253)
Affinity DataIC50:  2.50E+3nM. Assay description: Inhibition of human COX2 pre-incubated for 10 mins before substrate addition by enzyme immunoassay
In DepthDetails ArticlePubMed
TargetFatty-acid amide hydrolase 1 [30-579](Rattus norvegicus (rat))
Istituto Italiano Di Tecnologia
Curated by ChEMBL
LigandPNGBDBM50397554(CHEMBL2171253)
Affinity DataIC50: >1.00E+5nM. Assay description: Inhibition of FAAH in rat brain homogenates pre-incubated for 10 mins before addition of [3H]anandamide and [3H]AEA substrates for 30 mins by liquid ...
In DepthDetails ArticlePubMed
TargetProstaglandin G/H synthase 1(Ovis aries (Sheep))
Istituto Italiano Di Tecnologia
Curated by ChEMBL
LigandPNGBDBM50397554(CHEMBL2171253)
Affinity DataIC50:  4.10E+3nM. Assay description: Inhibition of ovine COX1 pre-incubated for 10 mins before arachidonic acid substrate addition by enzyme immunoassay
In DepthDetails ArticlePubMed