BDBM50397586 CHEMBL2171488
SMILES CCOc1ccc2c(cc(cc2n1)-c1cc2ccccc2nc1N1CCCC1)C(C)C
InChI Key InChIKey=SWGZWBMKPMUYCA-UHFFFAOYSA-N
Data  4 EC50
  Tab Delimited (TSV)   2D SDfile   Computed 3D by Vconf -m prep SDfile
Find this compound or compounds like it in BindingDB:
Activity Spreadsheet -- Enzyme Inhibition Constant Data from BindingDB
Found 4 hits for monomerid = 50397586
TargetBcl-2-related protein A1(Homo sapiens (Human))
Clermont Universit£
Curated by ChEMBL
LigandPNGBDBM50397586(CHEMBL2171488)
Affinity DataEC50:  2.55E+4nM. Assay description: Inhibition of GST-tagged recombinant Bfl1 interaction with biotinylated Bim peptide by ELISA based competitive binding assay
In DepthDetails ArticlePubMed
TargetInduced myeloid leukemia cell differentiation protein Mcl-1(Homo sapiens (Human))
Clermont Universit£
Curated by ChEMBL
LigandPNGBDBM50397586(CHEMBL2171488)
Affinity DataEC50:  2.10E+3nM. Assay description: Inhibition of GST-tagged recombinant Mcl1 interaction with biotinylated Bim peptide by ELISA based competitive binding assay
In DepthDetails ArticlePubMed
TargetApoptosis regulator Bcl-2(Homo sapiens (Human))
Clermont Universit£
Curated by ChEMBL
LigandPNGBDBM50397586(CHEMBL2171488)
Affinity DataEC50:  3.50E+3nM. Assay description: Inhibition of GST-tagged recombinant Bcl2 interaction with biotinylated Bim peptide by ELISA based competitive binding assay
In DepthDetails ArticlePubMed
TargetBcl-2-like protein 1(Homo sapiens (Human))
Clermont Universit£
Curated by ChEMBL
LigandPNGBDBM50397586(CHEMBL2171488)
Affinity DataEC50:  6.20E+3nM. Assay description: Inhibition of GST-tagged recombinant Bcl-XL interaction with biotinylated Bim peptide by ELISA based competitive binding assay
In DepthDetails ArticlePubMed