BDBM50397668 CHEMBL2017264
SMILES Cc1noc(C)c1-c1ccc2c(Nc3ccccc3F)c(cnc2c1)C(N)=O
InChI Key InChIKey=KFUKDXYDCKKZNK-UHFFFAOYSA-N
Data  3 IC50
  Tab Delimited (TSV)   2D SDfile   Computed 3D by Vconf -m prep SDfile
Find this compound or compounds like it in BindingDB:
Activity Spreadsheet -- Enzyme Inhibition Constant Data from BindingDB
Found 3 hits for monomerid = 50397668
TargetBromodomain-containing protein 4(Homo sapiens (Human))
Glaxosmithkline
Curated by ChEMBL
LigandPNGBDBM50397668(CHEMBL2017264)
Affinity DataIC50:  7.94E+3nM. Assay description: Binding affinity to BRD4 assessed as inhibition of Alexa Fluor 488 binding after 60 mins by fluorescence anisotropic analysis
In DepthDetails ArticlePubMed
TargetBromodomain-containing protein 2(Homo sapiens (Human))
Glaxosmithkline
Curated by ChEMBL
LigandPNGBDBM50397668(CHEMBL2017264)
Affinity DataIC50:  1.26E+4nM. Assay description: Binding affinity to human BRD2 assessed as inhibition of Alexa Fluor 488 binding after 60 mins by fluorescence anisotropic analysis
In DepthDetails ArticlePubMed
TargetBromodomain-containing protein 3(Homo sapiens (Human))
Glaxosmithkline
Curated by ChEMBL
LigandPNGBDBM50397668(CHEMBL2017264)
Affinity DataIC50:  3.16E+3nM. Assay description: Binding affinity to BRD3 assessed as inhibition of Alexa Fluor 488 binding after 60 mins by fluorescence anisotropic analysis
In DepthDetails ArticlePubMed