BDBM50397689 CHEMBL2181895
SMILES COCC(=O)N[C@@H](Cc1cccc(c1)-c1nc(C)cs1)[C@H](O)CN[C@H]1CC2(CCC2)Oc2ncc(CC(C)(C)C)cc12
InChI Key InChIKey=IBQBCHBBSWVJOQ-HZFUHODCSA-N
Data  3 IC50
  Tab Delimited (TSV)   2D SDfile   Computed 3D by Vconf -m prep SDfile
Find this compound or compounds like it in BindingDB:
Activity Spreadsheet -- Enzyme Inhibition Constant Data from BindingDB
Found 3 hits for monomerid = 50397689
TargetBeta-secretase 1(Homo sapiens (Human))
Amgen
Curated by ChEMBL
LigandPNGBDBM50397689(CHEMBL2181895)
Affinity DataIC50:  14nM. Assay description: Inhibition of BACE1 in human HEK293 cells expressing APP Swedish mutant assessed as inhibition of amyloid beta 40 production after overnight incubati...
In DepthDetails ArticlePubMed
TargetCytochrome P450 3A4(Homo sapiens (Human))
Amgen
Curated by ChEMBL
LigandPNGBDBM50397689(CHEMBL2181895)
Affinity DataIC50:  100nM. Assay description: Inhibition of CYP3A4 in human liver microsomes using midazolam as substrate after 10 mins by HPLC-MS analysis
In DepthDetails ArticlePubMed
TargetBeta-secretase 1(Homo sapiens (Human))
Amgen
Curated by ChEMBL
LigandPNGBDBM50397689(CHEMBL2181895)
Affinity DataIC50:  5.70nM. Assay description: Inhibition of human recombinant BACE1 using Glu-Ile-Asp-Leu-Met-Val-Leu-Asp as substrate incubated for 60 mins prior to substrate addition measured a...
In DepthDetails ArticlePubMed