BDBM50397699 CHEMBL2181915
SMILES CC(C)(C)Cc1cnc2OC3(CCC3)C[C@H](NC[C@@H](O)[C@H](Cc3cccc(c3)-c3nccs3)NC(=O)[C@H]3CCCO3)c2c1
InChI Key InChIKey=DZIXUQJNRCUJQW-QUAHOIDUSA-N
Data  2 IC50
  Tab Delimited (TSV)   2D SDfile   Computed 3D by Vconf -m prep SDfile
Find this compound or compounds like it in BindingDB:
Activity Spreadsheet -- Enzyme Inhibition Constant Data from BindingDB
Found 2 hits for monomerid = 50397699
TargetBeta-secretase 1(Homo sapiens (Human))
Amgen
Curated by ChEMBL
LigandPNGBDBM50397699(CHEMBL2181915)
Affinity DataIC50:  11nM. Assay description: Inhibition of BACE1 in human HEK293 cells expressing APP Swedish mutant assessed as inhibition of amyloid beta 40 production after overnight incubati...
In DepthDetails ArticlePubMed
TargetBeta-secretase 1(Homo sapiens (Human))
Amgen
Curated by ChEMBL
LigandPNGBDBM50397699(CHEMBL2181915)
Affinity DataIC50:  6.30nM. Assay description: Inhibition of human recombinant BACE1 using Glu-Ile-Asp-Leu-Met-Val-Leu-Asp as substrate incubated for 60 mins prior to substrate addition measured a...
In DepthDetails ArticlePubMed