BDBM50397947 CHEMBL2179960
SMILES CC(=O)C=C1CN2CCC1CC2
InChI Key InChIKey=XVFBZAKFUWQJMY-UHFFFAOYSA-N
Data  1 KI
  Tab Delimited (TSV)   2D SDfile   Computed 3D by Vconf -m prep SDfile
Find this compound or compounds like it in BindingDB:
Activity Spreadsheet -- Enzyme Inhibition Constant Data from BindingDB
Found 1 hit for monomerid = 50397947
TargetNeuronal acetylcholine receptor subunit alpha-4/beta-2(Homo sapiens (Human))
Targacept
Curated by ChEMBL
LigandPNGBDBM50397947(CHEMBL2179960)
Affinity DataKi:  13nM. Assay description: Binding affinity to human alpha4beta2 nAChR expressed in xenopus oocyte
In DepthDetails ArticlePubMed