BDBM50398202 CHEMBL2181535
SMILES C1CN(CCO1)c1ccc(\C=C\c2cc(c(\C=C\c3ccc(cc3)N3CCOCC3)nn2)-c2ccccc2)cc1
InChI Key InChIKey=BJKVYBWVKVZHHX-IRWMSUPXSA-N
Data  1 IC50
  Tab Delimited (TSV)   2D SDfile   Computed 3D by Vconf -m prep SDfile
Find this compound or compounds like it in BindingDB:
Activity Spreadsheet -- Enzyme Inhibition Constant Data from BindingDB
Found 1 hit for monomerid = 50398202
TargetMicrotubule-associated protein tau(Homo sapiens (Human))
Technische Universit£T Darmstadt
Curated by ChEMBL
LigandPNGBDBM50398202(CHEMBL2181535)
Affinity DataIC50:  4.71E+3nM. Assay description: Displacement of thiazene red from tau aggregate
In DepthDetails ArticlePubMed