BDBM50398276 CHEMBL2177910
SMILES Cc1cc(cc(C)n1)C1(N=C(N)c2c1cccc2F)c1cccc(c1)-c1cncnc1
InChI Key InChIKey=VBXIQPLJRJDWHB-UHFFFAOYSA-N
Data  3 IC50
  Tab Delimited (TSV)   2D SDfile   Computed 3D by Vconf -m prep SDfile
Find this compound or compounds like it in BindingDB:
Activity Spreadsheet -- Enzyme Inhibition Constant Data from BindingDB
Found 3 hits for monomerid = 50398276
TargetBeta-secretase 1(Homo sapiens (Human))
Astrazeneca
Curated by ChEMBL
LigandPNGBDBM50398276(CHEMBL2177910)
Affinity DataIC50:  11nM. Assay description: Inhibition of BACE1 in human SH-SY5Y cells assessed as inhibition of sAPPbeta release after 16 hrs by immunoassay
In DepthDetails ArticlePubMed
TargetPotassium voltage-gated channel subfamily H member 2(Homo sapiens (Human))
Astrazeneca
Curated by ChEMBL
LigandPNGBDBM50398276(CHEMBL2177910)
Affinity DataIC50:  6.40E+3nM. Assay description: Inhibition of human ERG expressed in CHO cells by IonWorks assay
In DepthDetails ArticlePubMed
TargetBeta-secretase 1(Homo sapiens (Human))
Astrazeneca
Curated by ChEMBL
LigandPNGBDBM50398276(CHEMBL2177910)
Affinity DataIC50:  1.38E+3nM. Assay description: Inhibition of human recombinant BACE1 using (europium)CEVNLDAEFK(Qsy7) as substrate incubated for 10 mins prior to substrate addition measured after ...
In DepthDetails ArticlePubMed