BDBM50398405 CHEMBL1606928
SMILES COc1ccc(NC(=O)NC(C)(C)c2cccc(c2)C(C)=C)cc1
InChI Key InChIKey=COICAVVRBNKTHS-UHFFFAOYSA-N
Data  2 IC50
  Tab Delimited (TSV)   2D SDfile   Computed 3D by Vconf -m prep SDfile
Find this compound or compounds like it in BindingDB:
Activity Spreadsheet -- Enzyme Inhibition Constant Data from BindingDB
Found 2 hits for monomerid = 50398405
TargetInosine-5'-monophosphate dehydrogenase(Cryptosporidium parvum)
Brandeis University
Curated by ChEMBL
LigandPNGBDBM50398405(CHEMBL1606928)
Affinity DataIC50:  21nM. Assay description: Inhibition of Cryptosporidium parvum recombinant IMPDH expressed in Escherichia coli assessed as production of NADH in presence of 0.05% fatty acid f...
In DepthDetails ArticlePubMed
TargetInosine-5'-monophosphate dehydrogenase(Cryptosporidium parvum)
Brandeis University
Curated by ChEMBL
LigandPNGBDBM50398405(CHEMBL1606928)
Affinity DataIC50:  9nM. Assay description: Inhibition of Cryptosporidium parvum recombinant IMPDH expressed in Escherichia coli assessed as production of NADH incubated for 5 mins by fluoresce...
In DepthDetails ArticlePubMed