BDBM50398433 CHEMBL2178637
SMILES CC(NC(=O)Nc1ccc(Cl)cc1)c1cccc(c1)C(C)=O
InChI Key InChIKey=BCAYZHCYPSFDPK-UHFFFAOYSA-N
Data  2 IC50
  Tab Delimited (TSV)   2D SDfile   Computed 3D by Vconf -m prep SDfile
Find this compound or compounds like it in BindingDB:
Activity Spreadsheet -- Enzyme Inhibition Constant Data from BindingDB
Found 2 hits for monomerid = 50398433
TargetInosine-5'-monophosphate dehydrogenase(Cryptosporidium parvum)
Brandeis University
Curated by ChEMBL
LigandPNGBDBM50398433(CHEMBL2178637)
Affinity DataIC50:  70nM. Assay description: Inhibition of Cryptosporidium parvum recombinant IMPDH expressed in Escherichia coli assessed as production of NADH incubated for 5 mins by fluoresce...
In DepthDetails ArticlePubMed
TargetInosine-5'-monophosphate dehydrogenase(Cryptosporidium parvum)
Brandeis University
Curated by ChEMBL
LigandPNGBDBM50398433(CHEMBL2178637)
Affinity DataIC50:  110nM. Assay description: Inhibition of Cryptosporidium parvum recombinant IMPDH expressed in Escherichia coli assessed as production of NADH in presence of 0.05% fatty acid f...
In DepthDetails ArticlePubMed