BDBM50398436 CHEMBL2178636
SMILES CC(=O)c1cccc(c1)C(C)(C)NC(=O)Nc1ccc(Cl)c(c1)C(N)=O
InChI Key InChIKey=PTPXOEDNFHJBRH-UHFFFAOYSA-N
Data  2 IC50
  Tab Delimited (TSV)   2D SDfile   Computed 3D by Vconf -m prep SDfile
Find this compound or compounds like it in BindingDB:
Activity Spreadsheet -- Enzyme Inhibition Constant Data from BindingDB
Found 2 hits for monomerid = 50398436
TargetInosine-5'-monophosphate dehydrogenase(Cryptosporidium parvum)
Brandeis University
Curated by ChEMBL
LigandPNGBDBM50398436(CHEMBL2178636)
Affinity DataIC50:  52nM. Assay description: Inhibition of Cryptosporidium parvum recombinant IMPDH expressed in Escherichia coli assessed as production of NADH in presence of 0.05% fatty acid f...
In DepthDetails ArticlePubMed
TargetInosine-5'-monophosphate dehydrogenase(Cryptosporidium parvum)
Brandeis University
Curated by ChEMBL
LigandPNGBDBM50398436(CHEMBL2178636)
Affinity DataIC50:  54nM. Assay description: Inhibition of Cryptosporidium parvum recombinant IMPDH expressed in Escherichia coli assessed as production of NADH incubated for 5 mins by fluoresce...
In DepthDetails ArticlePubMed