BDBM50398685 CHEMBL2178145
SMILES CN1C(N)=N[C@]2(CN(C[C@H]2C1=O)C(=O)c1ccccc1)c1cc(cs1)-c1cccc(c1)C#N
InChI Key InChIKey=POOXGNGZUXTIQE-CPJSRVTESA-N
Data  1 KI  1 IC50
  Tab Delimited (TSV)   2D SDfile   Computed 3D by Vconf -m prep SDfile
Find this compound or compounds like it in BindingDB:
Activity Spreadsheet -- Enzyme Inhibition Constant Data from BindingDB
Found 2 hits for monomerid = 50398685
TargetBeta-secretase 1(Homo sapiens (Human))
Merck Research Laboratories
Curated by ChEMBL
LigandPNGBDBM50398685(CHEMBL2178145)
Affinity DataKi:  3nM. Assay description: Inhibition of BACE1
In DepthDetails ArticlePubMed
TargetBeta-secretase 1(Homo sapiens (Human))
Merck Research Laboratories
Curated by ChEMBL
LigandPNGBDBM50398685(CHEMBL2178145)
Affinity DataIC50:  19nM. Assay description: Inhibition of BACE1 in HEK293 cells
In DepthDetails ArticlePubMed