BDBM50398953 CHEMBL2179266
SMILES Clc1nnc(NCCCn2ccnc2)c2ccccc12
InChI Key InChIKey=PEDMHJXYRFPUDU-UHFFFAOYSA-N
Data  1 IC50
  Tab Delimited (TSV)   2D SDfile   Computed 3D by Vconf -m prep SDfile
Find this compound or compounds like it in BindingDB:
Activity Spreadsheet -- Enzyme Inhibition Constant Data from BindingDB
Found 1 hit for monomerid = 50398953
TargetSuperoxide dismutase [Cu-Zn](Homo sapiens (Human))
Universidad De Granada
Curated by ChEMBL
LigandPNGBDBM50398953(CHEMBL2179266)
Affinity DataIC50:  8.31E+4nM. Assay description: Inhibition of SOD1 in human erythrocytes by spectrophotometry
In DepthDetails ArticlePubMed