BDBM50399062 CHEMBL2178843
SMILES Oc1cccc(c1)-c1ccc(Oc2cccc(c2)C#N)cn1
InChI Key InChIKey=VUWYQPZMKVVUEX-UHFFFAOYSA-N
Data  1 KI
  Tab Delimited (TSV)   2D SDfile   Computed 3D by Vconf -m prep SDfile
Find this compound or compounds like it in BindingDB:
Activity Spreadsheet -- Enzyme Inhibition Constant Data from BindingDB
Found 1 hit for monomerid = 50399062
TargetMacrophage migration inhibitory factor(Plasmodium falciparum)
Yale University
Curated by ChEMBL
LigandPNGBDBM50399062(CHEMBL2178843)
Affinity DataKi:  370nM. Assay description: Inhibition of recombinant Plasmodium falciparum MIF expressed in Escherichia coli BL21 (DE3) assessed as ketonization of enol form of 4-HPP substrate...
In DepthDetails ArticlePubMed