BDBM50399159 CHEMBL2180144
SMILES Clc1c2ccccc2nc2ccccc12
InChI Key InChIKey=BPXINCHFOLVVSG-UHFFFAOYSA-N
Data  3 IC50
  Tab Delimited (TSV)   2D SDfile   Computed 3D by Vconf -m prep SDfile
Find this compound or compounds like it in BindingDB:
Activity Spreadsheet -- Enzyme Inhibition Constant Data from BindingDB
Found 3 hits for monomerid = 50399159
TargetP2X purinoceptor 4(Homo sapiens (Human))
University Of Bonn
Curated by ChEMBL
LigandPNGBDBM50399159(CHEMBL2180144)
Affinity DataIC50: >1.00E+4nM. Assay description: Antagonist activity at human P2X4 receptor expressed in 1321N1 cells assessed as inhibition of ATP-induced cytosolic calcium influx compound preincub...
In DepthDetails ArticlePubMed
TargetAmine oxidase [flavin-containing] B(Homo sapiens (Human))
North-West University
Curated by ChEMBL
LigandPNGBDBM50399159(CHEMBL2180144)
Affinity DataIC50:  9.19E+4nM. Assay description: Inhibition of recombinant human MAO-B expressed in baculovirus infected BTI insect cells using kynuramine as substrate after 20 mins by fluorescence ...
In DepthDetails PubMed
TargetAmine oxidase [flavin-containing] A(Homo sapiens (Human))
North-West University
Curated by ChEMBL
LigandPNGBDBM50399159(CHEMBL2180144)
Affinity DataIC50:  1.21E+4nM. Assay description: Inhibition of recombinant human MAO-A expressed in baculovirus infected BTI insect cells using kynuramine as substrate after 20 mins by fluorescence ...
In DepthDetails PubMed