BDBM50399176 CHEMBL2180170
SMILES Clc1cc(Cl)cc(CNC(=O)N2c3ccccc3Oc3ccccc23)c1
InChI Key InChIKey=VXKPROCFAMXLKX-UHFFFAOYSA-N
Data  1 IC50
  Tab Delimited (TSV)   2D SDfile   Computed 3D by Vconf -m prep SDfile
Find this compound or compounds like it in BindingDB:
Activity Spreadsheet -- Enzyme Inhibition Constant Data from BindingDB
Found 1 hit for monomerid = 50399176
TargetP2X purinoceptor 4(Homo sapiens (Human))
University Of Bonn
Curated by ChEMBL
LigandPNGBDBM50399176(CHEMBL2180170)
Affinity DataIC50: >1.00E+4nM. Assay description: Antagonist activity at human P2X4 receptor expressed in 1321N1 cells assessed as inhibition of ATP-induced cytosolic calcium influx compound preincub...
In DepthDetails ArticlePubMed