BDBM50399284 CHEMBL2180823
SMILES COS(=O)(=O)CCCCCCCc1ccc(OCc2ccccc2)cc1
InChI Key InChIKey=OORGBVCMIFVWGN-UHFFFAOYSA-N
Data  1 IC50
  Tab Delimited (TSV)   2D SDfile   Computed 3D by Vconf -m prep SDfile
Find this compound or compounds like it in BindingDB:
Activity Spreadsheet -- Enzyme Inhibition Constant Data from BindingDB
Found 1 hit for monomerid = 50399284
TargetMonoglyceride lipase(Homo sapiens (Human))
Northeastern University
Curated by ChEMBL
LigandPNGBDBM50399284(CHEMBL2180823)
Affinity DataIC50: >5.00E+3nM. Assay description: Inhibition of recombinant human hexahistidine-tagged MGL expressed in Escherichia coli using AHMMCE as substrate after 15 mins by medium throughput f...
In DepthDetails ArticlePubMed