BDBM50399309 CHEMBL2180855
SMILES Fc1cccc(NC(=O)Nc2cccc3C(=O)N4CCCCC4c23)n1
InChI Key InChIKey=PRRNEKPNFWMEPT-UHFFFAOYSA-N
Data  2 IC50
  Tab Delimited (TSV)   2D SDfile   Computed 3D by Vconf -m prep SDfile
Find this compound or compounds like it in BindingDB:
Activity Spreadsheet -- Enzyme Inhibition Constant Data from BindingDB
Found 2 hits for monomerid = 50399309
TargetDual specificity tyrosine-phosphorylation-regulated kinase 1A(Homo sapiens (Human))
Universit£
Curated by ChEMBL
LigandPNGBDBM50399309(CHEMBL2180855)
Affinity DataIC50:  3.50E+3nM. Assay description: Inhibition of human recombinant GST-fused DYRK1A expressed in Escherichia coli using KKISGRLSPIMTEQ as substrate and [gamma-33P]-ATP after 30 mins by...
In DepthDetails ArticlePubMed
TargetCyclin-dependent kinase 5 activator 1(Homo sapiens (Human))
Universit£
Curated by ChEMBL
LigandPNGBDBM50399309(CHEMBL2180855)
Affinity DataIC50:  90nM. Assay description: Inhibition of human recombinant CDK5/p25 using histone H1 as substrate and [gamma-33P]-ATP after 30 mins by scintillation counting
In DepthDetails ArticlePubMed