BDBM50399678 CHEMBL2178369
SMILES Cc1nc(C)c(nc1C(N)=O)-c1ccc2c(CC[C@@]22CC[C@H](Cc3nnn[nH]3)CC2)c1
InChI Key InChIKey=RYUVHHFBAIAIHW-CWSKOGRWSA-N
Data  1 IC50
  Tab Delimited (TSV)   2D SDfile   Computed 3D by Vconf -m prep SDfile
Find this compound or compounds like it in BindingDB:
Activity Spreadsheet -- Enzyme Inhibition Constant Data from BindingDB
Found 1 hit for monomerid = 50399678
TargetDiacylglycerol O-acyltransferase 1(Homo sapiens (Human))
Astrazeneca
Curated by ChEMBL
LigandPNGBDBM50399678(CHEMBL2178369)
Affinity DataIC50:  30nM. Assay description: Inhibition of human recombinant DGAT1 expressed in Sf9 cells by liquid scintillography
In DepthDetails ArticlePubMed