BDBM50400027 CHEMBL2177716
SMILES CCN(C)C(=O)Oc1cccc2N(CCC(=O)OC)CCc12
InChI Key InChIKey=LOMCJSSKKKRIAR-UHFFFAOYSA-N
Data  4 IC50
  Tab Delimited (TSV)   2D SDfile   Computed 3D by Vconf -m prep SDfile
Find this compound or compounds like it in BindingDB:
Activity Spreadsheet -- Enzyme Inhibition Constant Data from BindingDB
Found 4 hits for monomerid = 50400027
TargetAcetylcholinesterase(Bos taurus (bovine))
Bar-Ilan University
Curated by ChEMBL
LigandPNGBDBM50400027(CHEMBL2177716)
Affinity DataIC50:  5.60E+3nM. Assay description: Inhibition of AChE in bovine erythrocytes using acetylthiocholine iodide as substrate by Ellman's method
In DepthDetails ArticlePubMed
TargetAcetylcholinesterase(Bos taurus (bovine))
Bar-Ilan University
Curated by ChEMBL
LigandPNGBDBM50400027(CHEMBL2177716)
Affinity DataIC50:  5.60E+3nM. Assay description: Inhibition of bovine AChE after 120 mins by Ellman's method
In DepthDetails ArticlePubMed
TargetCarboxylic ester hydrolase(Equus caballus (Horse))
Bar-Ilan University
Curated by ChEMBL
LigandPNGBDBM50400027(CHEMBL2177716)
Affinity DataIC50:  700nM. Assay description: Inhibition of equine BuChE after 120 mins by Ellman's method
In DepthDetails ArticlePubMed
TargetCholinesterase(Equus caballus (Horse))
Bar-Ilan University
Curated by ChEMBL
LigandPNGBDBM50400027(CHEMBL2177716)
Affinity DataIC50:  700nM. Assay description: Inhibition of BuChE in equine serum using butylthiocholine iodide as substrate by Ellman's method
In DepthDetails ArticlePubMed