BDBM50400117 CHEMBL2178434
SMILES Cc1c(C)c(=O)oc2cc(OCc3nnc(Nc4ccc(Cl)cc4)s3)ccc12
InChI Key InChIKey=OGWLBGOQYRRHHE-UHFFFAOYSA-N
Data  2 KI
  Tab Delimited (TSV)   2D SDfile   Computed 3D by Vconf -m prep SDfile
Find this compound or compounds like it in BindingDB:
Activity Spreadsheet -- Enzyme Inhibition Constant Data from BindingDB
Found 2 hits for monomerid = 50400117
TargetAmine oxidase [flavin-containing] A(Bos taurus)
National Research Center
Curated by ChEMBL
LigandPNGBDBM50400117(CHEMBL2178434)
Affinity DataKi:  0.00700nM. Assay description: Inhibition of bovine brain MAOA using kinuramine as substrate preincubated for 30 mins prior to substrate addition measured after 30 mins by fluorome...
In DepthDetails ArticlePubMed
TargetAmine oxidase [flavin-containing] B(Bos taurus)
National Research Center
Curated by ChEMBL
LigandPNGBDBM50400117(CHEMBL2178434)
Affinity DataKi:  554nM. Assay description: Inhibition of bovine brain MAOB using kinuramine as substrate preincubated for 30 mins prior to substrate addition measured after 30 mins by fluorome...
In DepthDetails ArticlePubMed