BDBM50400241 CHEMBL2179478
SMILES Cc1ccc2Nc3nc(ccc3CN(c2c1C)S(=O)(=O)c1ccc(cc1)C(C)(C)C#N)C(F)(F)F
InChI Key InChIKey=PCFYUZVQRMZFEB-UHFFFAOYSA-N
Data  1 IC50  2 EC50
  Tab Delimited (TSV)   2D SDfile   Computed 3D by Vconf -m prep SDfile
Find this compound or compounds like it in BindingDB:
Activity Spreadsheet -- Enzyme Inhibition Constant Data from BindingDB
Found 3 hits for monomerid = 50400241
TargetBombesin receptor subtype-3(Mus musculus)
TBA
Curated by ChEMBL
LigandPNGBDBM50400241(CHEMBL2179478)
Affinity DataEC50:  79nM. Assay description: Agonist activity at mouse BRS3 expressed in HEK293 cells expressing aequorin measured for 30 secs by bioluminescence assay
In DepthDetails ArticlePubMed
TargetBombesin receptor subtype-3(Homo sapiens (Human))
TBA
Curated by ChEMBL
LigandPNGBDBM50400241(CHEMBL2179478)
Affinity DataIC50:  5.70nM. Assay description: Displacement of [125I]-[D-Tyr6,beta-Ala11,Phe13,Nle14]-Bombesin(6-14) from human BRS3 expressed in CHO cells expressing NFAT after 2 hrs by liquid sc...
In DepthDetails ArticlePubMed
TargetBombesin receptor subtype-3(Homo sapiens (Human))
TBA
Curated by ChEMBL
LigandPNGBDBM50400241(CHEMBL2179478)
Affinity DataEC50:  60nM. Assay description: Agonist activity at human BRS3 expressed in HEK293 cells expressing aequorin measured for 30 secs by bioluminescence assay
In DepthDetails ArticlePubMed