BDBM50400419 CHEMBL2178453
SMILES Cc1c(OCc2ccc(cc2)-c2ccccc2)ccc2c(C)c(CC(O)=O)c(=O)oc12
InChI Key InChIKey=KROLQRNRDDRFIU-UHFFFAOYSA-N
Data  1 IC50
  Tab Delimited (TSV)   2D SDfile   Computed 3D by Vconf -m prep SDfile
Find this compound or compounds like it in BindingDB:
Activity Spreadsheet -- Enzyme Inhibition Constant Data from BindingDB
Found 1 hit for monomerid = 50400419
TargetReplicative DNA helicase(Bacillus anthracis)
Microbiotix
Curated by ChEMBL
LigandPNGBDBM50400419(CHEMBL2178453)
Affinity DataIC50:  9.00E+3nM. Assay description: Inhibition of Bacillus anthracis Sterne 34F2 replicative DNA helicase-mediated ATP-dependent dissociation of Hel-5'FAM:Hel-3'BHQ by FRET assay
In DepthDetails ArticlePubMed