BDBM50400522 CHEMBL2204931
SMILES Cn1cc(cn1)[C@@H]1N[C@H](Cc2c1[nH]c1ccccc21)c1nc(c[nH]1)-c1ccc(F)cc1
InChI Key InChIKey=UCGLIDADIQNGPX-IRLDBZIGSA-N
Data  1 KI  4 IC50
  Tab Delimited (TSV)   2D SDfile   Computed 3D by Vconf -m prep SDfile
Find this compound or compounds like it in BindingDB:
Activity Spreadsheet -- Enzyme Inhibition Constant Data from BindingDB
Found 5 hits for monomerid = 50400522
TargetPotassium voltage-gated channel subfamily H member 2(Homo sapiens (Human))
TBA
Curated by ChEMBL
LigandPNGBDBM50400522(CHEMBL2204931)
Affinity DataKi:  2.19E+3nM. Assay description: Displacement of radiolabeled MK-499 from human ERG channel
In DepthDetails ArticlePubMed
TargetSomatostatin receptor type 3(Homo sapiens (Human))
TBA
Curated by ChEMBL
LigandPNGBDBM50400522(CHEMBL2204931)
Affinity DataIC50:  33nM. Assay description: Inhibition of human SSTR3 transfected in CHO cells assessed as inhibition of SRIF-induced reduction of cAMP accumulation after 45 mins
In DepthDetails ArticlePubMed
TargetSomatostatin receptor type 3(MOUSE)
TBA
Curated by ChEMBL
LigandPNGBDBM50400522(CHEMBL2204931)
Affinity DataIC50:  4.80nM. Assay description: Displacement of [125I]SS-28 from mouse SSTR3 transfected in CHO cells after 60 to 90 mins
In DepthDetails ArticlePubMed
TargetSomatostatin receptor type 3(MOUSE)
TBA
Curated by ChEMBL
LigandPNGBDBM50400522(CHEMBL2204931)
Affinity DataIC50:  26nM. Assay description: Inhibition of mouse SSTR3 transfected in CHO cells assessed as inhibition of SRIF-induced reduction of cAMP accumulation after 45 mins
In DepthDetails ArticlePubMed
TargetSomatostatin receptor type 3(Homo sapiens (Human))
TBA
Curated by ChEMBL
LigandPNGBDBM50400522(CHEMBL2204931)
Affinity DataIC50:  7.20nM. Assay description: Displacement of [125I]SS-28 from human SSTR3 transfected in CHO cells after 60 to 90 mins
In DepthDetails ArticlePubMed