BDBM50400723 CHEMBL2203546
SMILES [#6]-[#8]-c1ccc2c(\[#6]=[#6]-3\[#6](=O)-[#7]-[#6](=S)-[#7]-[#6]-3=O)cccc2c1
InChI Key InChIKey=HNBLDVOULRZFLV-UHFFFAOYSA-N
Data  4 IC50
  Tab Delimited (TSV)   2D SDfile   Computed 3D by Vconf -m prep SDfile
Find this compound or compounds like it in BindingDB:
Activity Spreadsheet -- Enzyme Inhibition Constant Data from BindingDB
Found 4 hits for monomerid = 50400723
TargetNAD-dependent protein deacylase sirtuin-5, mitochondrial(Homo sapiens (Human))
TBA
Curated by ChEMBL
LigandPNGBDBM50400723(CHEMBL2203546)
Affinity DataIC50:  2.24E+4nM. Assay description: Inhibition of SIRT5 using ZK(suc)A substrate after 1 hr by homogeneous fluorescence assay
In DepthDetails ArticlePubMed
LigandPNGBDBM50400723(CHEMBL2203546)
Affinity DataIC50:  4.33E+4nM. Assay description: Inhibition of recombinant SIRT3 using ZMAL substrate after 4 hrs by homogeneous fluorescence assay
In DepthDetails ArticlePubMed
TargetNAD-dependent protein deacetylase sirtuin-1(Homo sapiens (Human))
TBA
Curated by ChEMBL
LigandPNGBDBM50400723(CHEMBL2203546)
Affinity DataIC50:  6.00E+3nM. Assay description: Inhibition of recombinant SIRT1 using ZMAL substrate after 4 hrs by homogeneous fluorescence assay
In DepthDetails ArticlePubMed
TargetNAD-dependent protein deacetylase sirtuin-2(Homo sapiens (Human))
TBA
Curated by ChEMBL
LigandPNGBDBM50400723(CHEMBL2203546)
Affinity DataIC50:  1.17E+4nM. Assay description: Inhibition of recombinant SIRT2 using ZMAL substrate after 4 hrs by homogeneous fluorescence assay
In DepthDetails ArticlePubMed