BDBM50400766 CHEMBL2204980
SMILES CN(C)C(=O)c1ccc(Nc2ncnc(N3CCC(CC3)c3nc(no3)C(C)(C)F)c2F)c(F)c1
InChI Key InChIKey=XGJZRVVCWLCQCJ-UHFFFAOYSA-N
Data  1 EC50
  Tab Delimited (TSV)   2D SDfile   Computed 3D by Vconf -m prep SDfile
Find this compound or compounds like it in BindingDB:
Activity Spreadsheet -- Enzyme Inhibition Constant Data from BindingDB
Found 1 hit for monomerid = 50400766
TargetGlucose-dependent insulinotropic receptor(Homo sapiens (Human))
TBA
Curated by ChEMBL
LigandPNGBDBM50400766(CHEMBL2204980)
Affinity DataEC50:  23nM. Assay description: Agonist activity at GPR119 expressed in CHO-K1 cells assessed as cAMP level after 1 hr by homogenous time-resolved fluorescence assay
In DepthDetails ArticlePubMed