BDBM50401148 CHEMBL2205765
SMILES CC(C)NS(=O)(=O)c1cncc(c1)-c1ccn2nc(N)nc2c1
InChI Key InChIKey=HRZFUMGOVROJJL-UHFFFAOYSA-N
Data  4 IC50
  Tab Delimited (TSV)   2D SDfile   Computed 3D by Vconf -m prep SDfile
Find this compound or compounds like it in BindingDB:
Activity Spreadsheet -- Enzyme Inhibition Constant Data from BindingDB
Found 4 hits for monomerid = 50401148
LigandPNGBDBM50401148(CHEMBL2205765)
Affinity DataIC50:  3.16E+7nM. Assay description: Inhibition of PIK3Cd
In DepthDetails ArticlePubMed
LigandPNGBDBM50401148(CHEMBL2205765)
Affinity DataIC50:  6.31E+7nM. Assay description: Inhibition of PIK3Cb
In DepthDetails ArticlePubMed
LigandPNGBDBM50401148(CHEMBL2205765)
Affinity DataIC50:  1.26E+7nM. Assay description: Inhibition of PIK3Ca
In DepthDetails ArticlePubMed
LigandPNGBDBM50401148(CHEMBL2205765)
Affinity DataIC50:  25nM. Assay description: Inhibition of PIK3Cg
In DepthDetails ArticlePubMed