BDBM50401200 CHEMBL2206397
SMILES CCc1cccc(CC)c1Cc1ncc[nH]1
InChI Key InChIKey=NIRASHDWADNQJU-UHFFFAOYSA-N
Data  2 KI
  Tab Delimited (TSV)   2D SDfile   Computed 3D by Vconf -m prep SDfile
Find this compound or compounds like it in BindingDB:
Activity Spreadsheet -- Enzyme Inhibition Constant Data from BindingDB
Found 2 hits for monomerid = 50401200
TargetTrace amine-associated receptor 1(Homo sapiens (Human))
F. Hoffmann-La Roche
Curated by ChEMBL
LigandPNGBDBM50401200(CHEMBL2206397)
Affinity DataKi:  24nM. Assay description: Displacement of (S)-4-(2,4-difluorophenyl-3-tritio) -4,5-dihydro-2-oxazolamine from human TAAR1 receptor expressed in HEK293 cells after 90 mins by b...
In DepthDetails ArticlePubMed
Target5-hydroxytryptamine receptor 1A(Homo sapiens (Human))
F. Hoffmann-La Roche
Curated by ChEMBL
LigandPNGBDBM50401200(CHEMBL2206397)
Affinity DataKi:  1.30E+3nM. Assay description: Inhibition of human 5-HT1A receptor by CEREP assay
In DepthDetails ArticlePubMed