BDBM50401213 CHEMBL2206382
SMILES COc1ccc(cc1)N(Cc1cnc[nH]1)C(C)C
InChI Key InChIKey=WVVVJKFSBIWQSW-UHFFFAOYSA-N
Data  1 KI
  Tab Delimited (TSV)   2D SDfile   Computed 3D by Vconf -m prep SDfile
Find this compound or compounds like it in BindingDB:
Activity Spreadsheet -- Enzyme Inhibition Constant Data from BindingDB
Found 1 hit for monomerid = 50401213
TargetTrace amine-associated receptor 1(Homo sapiens (Human))
F. Hoffmann-La Roche
Curated by ChEMBL
LigandPNGBDBM50401213(CHEMBL2206382)
Affinity DataKi:  80nM. Assay description: Displacement of (S)-4-(2,4-difluorophenyl-3-tritio) -4,5-dihydro-2-oxazolamine from human TAAR1 receptor expressed in HEK293 cells after 90 mins by b...
In DepthDetails ArticlePubMed