BDBM50401326 CHEMBL2205227
SMILES CCOc1c(C(=O)NC2CCN(CC2)C(=O)CO)n(C)c2cc(CC)n(CC(=O)c3ccccc3)c(=O)c12
InChI Key InChIKey=FHSGJFUSNPLKIT-UHFFFAOYSA-N
Data  1 IC50
  Tab Delimited (TSV)   2D SDfile   Computed 3D by Vconf -m prep SDfile
Find this compound or compounds like it in BindingDB:
Activity Spreadsheet -- Enzyme Inhibition Constant Data from BindingDB
Found 1 hit for monomerid = 50401326
TargetSonic hedgehog protein(Mus musculus (Mouse))
Takeda Pharmaceutical
Curated by ChEMBL
LigandPNGBDBM50401326(CHEMBL2205227)
Affinity DataIC50:  6.90nM. Assay description: Inhibition of recombinant mouse Shh-N expressed in mouse NIH3T3/Gli-luc cells assessed as inhibition of Gli1 expression after 48 hrs by luciferase re...
In DepthDetails ArticlePubMed