BDBM50401372 CHEMBL2205819
SMILES OC12C3C4C5C3C(C3C5CC4C13)N2CCCc1ccccc1
InChI Key InChIKey=GOYQRMVWIWPDFU-UHFFFAOYSA-N
Data  2 KI
  Tab Delimited (TSV)   2D SDfile   Computed 3D by Vconf -m prep SDfile
Find this compound or compounds like it in BindingDB:
Activity Spreadsheet -- Enzyme Inhibition Constant Data from BindingDB
Found 2 hits for monomerid = 50401372
TargetSigma non-opioid intracellular receptor 1(RAT)
The University Of Sydney
Curated by ChEMBL
LigandPNGBDBM50401372(CHEMBL2205819)
Affinity DataKi:  17nM. Assay description: Displacement of [3H](+)-pentazocine from rat brain sigma1 receptor
In DepthDetails ArticlePubMed
TargetSigma non-opioid intracellular receptor 1(Cavia porcellus (Guinea pig))
Northeast Ohio Medical University
Curated by ChEMBL
LigandPNGBDBM50401372(CHEMBL2205819)
Affinity DataKi:  20.9nM. Assay description: Displacement of [3H](+)-pentazocine from sigma-1 receptor in guinea pig brain
In DepthDetails ArticlePubMed