BDBM50401380 CHEMBL2205828
SMILES COc1cc(CN2C3C4C5C6C4C2(O)C2C6CC5C32)cc(OC)c1
InChI Key InChIKey=QUMVESOWCHBEEV-UHFFFAOYSA-N
Data  1 KI
  Tab Delimited (TSV)   2D SDfile   Computed 3D by Vconf -m prep SDfile
Find this compound or compounds like it in BindingDB:
Activity Spreadsheet -- Enzyme Inhibition Constant Data from BindingDB
Found 1 hit for monomerid = 50401380
TargetSigma non-opioid intracellular receptor 1(RAT)
The University Of Sydney
Curated by ChEMBL
LigandPNGBDBM50401380(CHEMBL2205828)
Affinity DataKi:  610nM. Assay description: Displacement of [3H](+)-pentazocine from rat brain sigma1 receptor
In DepthDetails ArticlePubMed