BDBM50401536 CHEMBL2206489
SMILES O[As]([O-])(=O)c1ccccc1
InChI Key InChIKey=LVKZSFMYNWRPJX-UHFFFAOYSA-M
Data  4 KI
  Tab Delimited (TSV)   2D SDfile   Computed 3D by Vconf -m prep SDfile
Find this compound or compounds like it in BindingDB:
Activity Spreadsheet -- Enzyme Inhibition Constant Data from BindingDB
Found 4 hits for monomerid = 50401536
TargetCarbonic anhydrase 1(Homo sapiens (Human))
Universit£
Curated by ChEMBL
LigandPNGBDBM50401536(CHEMBL2206489)
Affinity DataKi:  3.17E+7nM. Assay description: Inhibition of human cytosolic carbonic anhydrase 1 preincubated for 15 mins by stopped flow CO2 hydration assay
In DepthDetails ArticlePubMed
TargetCarbonic anhydrase 1(Homo sapiens (Human))
Universit£
Curated by ChEMBL
LigandPNGBDBM50401536(CHEMBL2206489)
Affinity DataKi:  3.17E+7nM. Assay description: Inhibition of human CA1 incubated for 15 mins prior to testing by stopped flow CO2 hydrase assay
In DepthDetails ArticlePubMed
TargetCarbonic anhydrase 2(Homo sapiens (Human))
Universit£
Curated by ChEMBL
LigandPNGBDBM50401536(CHEMBL2206489)
Affinity DataKi:  4.92E+7nM. Assay description: Inhibition of human CA2 incubated for 15 mins prior to testing by stopped flow CO2 hydrase assay
In DepthDetails ArticlePubMed
TargetCarbonic anhydrase 2(Homo sapiens (Human))
Universit£
Curated by ChEMBL
LigandPNGBDBM50401536(CHEMBL2206489)
Affinity DataKi:  4.92E+7nM. Assay description: Inhibition of human cytosolic carbonic anhydrase 2 preincubated for 15 mins by stopped flow CO2 hydration assay
In DepthDetails ArticlePubMed