BDBM50401680 CHEMBL2205909
SMILES CCN(C)c1ncnc2sc3c(ncn(-c4ccc(OC)cc4)c3=O)c12
InChI Key InChIKey=PZECAZVVKYJHFH-UHFFFAOYSA-N
Data  2 IC50
  Tab Delimited (TSV)   2D SDfile   Computed 3D by Vconf -m prep SDfile
Find this compound or compounds like it in BindingDB:
Activity Spreadsheet -- Enzyme Inhibition Constant Data from BindingDB
Found 2 hits for monomerid = 50401680
TargetMetabotropic glutamate receptor 1(Homo sapiens (Human))
Merck Research Laboratories
Curated by ChEMBL
LigandPNGBDBM50401680(CHEMBL2205909)
Affinity DataIC50:  3nM. Assay description: Antagonist activity at human mGluR1
In DepthDetails ArticlePubMed
TargetMetabotropic glutamate receptor 5(Homo sapiens (Human))
Merck Research Laboratories
Curated by ChEMBL
LigandPNGBDBM50401680(CHEMBL2205909)
Affinity DataIC50:  1.00E+4nM. Assay description: Antagonist activity at human mGluR5
In DepthDetails ArticlePubMed