BDBM50401733 CHEMBL2206536
SMILES CN1CC(c2ccc(F)c(F)c2)c2ccc(C)cc2C1
InChI Key InChIKey=WUPUWAHXLJUMFK-UHFFFAOYSA-N
Data  3 KI
  Tab Delimited (TSV)   2D SDfile   Computed 3D by Vconf -m prep SDfile
Find this compound or compounds like it in BindingDB:
Activity Spreadsheet -- Enzyme Inhibition Constant Data from BindingDB
Found 3 hits for monomerid = 50401733
TargetSodium-dependent noradrenaline transporter(Homo sapiens (Human))
Amri
Curated by ChEMBL
LigandPNGBDBM50401733(CHEMBL2206536)
Affinity DataKi:  14nM. Assay description: Inhibition of human NET
In DepthDetails ArticlePubMed
TargetSodium-dependent dopamine transporter(Homo sapiens (Human))
Amri
Curated by ChEMBL
LigandPNGBDBM50401733(CHEMBL2206536)
Affinity DataKi:  106nM. Assay description: Inhibition of DAT
In DepthDetails ArticlePubMed
TargetSodium-dependent serotonin transporter(Homo sapiens (Human))
Amri
Curated by ChEMBL
LigandPNGBDBM50401733(CHEMBL2206536)
Affinity DataKi:  594nM. Assay description: Inhibition of SERT
In DepthDetails ArticlePubMed