BDBM50401856 CHEMBL2204664
SMILES CC(C)(C)C(CCCCC(=O)NO)CC(=O)Nc1ccccc1
InChI Key InChIKey=JRMBLOKETNNOQB-UHFFFAOYSA-N
Data  3 IC50
  Tab Delimited (TSV)   2D SDfile   Computed 3D by Vconf -m prep SDfile
Find this compound or compounds like it in BindingDB:
Activity Spreadsheet -- Enzyme Inhibition Constant Data from BindingDB
Found 3 hits for monomerid = 50401856
TargetHistone deacetylase 6(Homo sapiens (Human))
Wayne State University
Curated by ChEMBL
LigandPNGBDBM50401856(CHEMBL2204664)
Affinity DataIC50:  2.40E+3nM. Assay description: Inhibition of HDAC6 using Fluor-de-Lys as substrate compound pretreated for 30 mins before substrate addition by fluorescence assay
In DepthDetails ArticlePubMed
TargetHistone deacetylase 1(Homo sapiens (Human))
Wayne State University
Curated by ChEMBL
LigandPNGBDBM50401856(CHEMBL2204664)
Affinity DataIC50:  990nM. Assay description: Inhibition of HDAC1 using Fluor-de-Lys as substrate compound pretreated for 30 mins before substrate addition by fluorescence assay
In DepthDetails ArticlePubMed
TargetHistone deacetylase 3(Homo sapiens (Human))
Wayne State University
Curated by ChEMBL
LigandPNGBDBM50401856(CHEMBL2204664)
Affinity DataIC50:  5.40E+3nM. Assay description: Inhibition of HDAC3 using Fluor-de-Lys as substrate compound pretreated for 30 mins before substrate addition by fluorescence assay
In DepthDetails ArticlePubMed